Target
Peroxisome proliferator-activated receptor gamma
Ligand
BDBM28676
Substrate
[3H]rosiglitazone
Meas. Tech.
Radioligand Binding Assay (IC50) and Cell-Based Transcription Assay (EC50)
IC50
6310±n/a nM
Citation
 Shearer, BGPatel, HSBillin, ANWay, JMWinegar, DALambert, MHXu, RXLeesnitzer, LMMerrihew, RVHuet, SWillson, TM Discovery of a novel class of PPARdelta partial agonists. Bioorg Med Chem Lett 18:5018-22 (2008)  
Target
Name:
Peroxisome proliferator-activated receptor gamma
Synonyms:
NR1C3 PPAR-gamma PPARG_HUMAN Peroxisome proliferator-activated receptor gamma (PPAR gamma) Peroxisome proliferator-activated receptor gamma (PPARĪ³) peroxisome proliferator-activated receptor gamma isoform 2
Type:
Nuclear Receptor
Mol. Mass.:
57613.46
Organism:
Homo sapiens (Human)
Description:
P37231
Residue:
505
  
Inhibitor
Name:
BDBM28676
Synonyms:
5-chloro-2-({3-[(6-methoxy-1,2,3,4-tetrahydroisoquinoline-2-)sulfonyl]benzene}amido)benzoic acid | Anthranilic acid deriv., 15
Type:
Small organic molecule
Emp. Form.:
C24H21ClN2O6S
Mol. Mass.:
500.951
SMILES:
COc1ccc2CN(CCc2c1)S(=O)(=O)c1cccc(c1)C(=O)Nc1ccc(Cl)cc1C(O)=O
:
Substrate
Name:
BDBM28681
Synonyms:
5-[(4-{2-[methyl(pyridin-2-yl)amino]ethoxy}phenyl)methyl]-1,3-thiazolidine-2,4-dione BRL 49653 CHEMBL121 [3H]rosiglitazone rosiglitazone
Type:
radiolabeled ligand
Emp. Form.:
C18H19N3O3S
Mol. Mass.:
357.427
SMILES:
CN(CCOc1ccc(Cc2sc(=O)[nH]c2O)cc1)c1ccccn1
: