Target
Toll-like receptor 7
Ligand
BDBM393034
Substrate
Meas. Tech.
In Vitro Receptor Binding Activity Screening Assay
EC50
5.5±n/a nM
Citation
 Ding, ZWu, HSun, FWu, LYang, L Pyrrolopyrimidine compounds used as TLR7 agonist US Patent  US9962388 Publication Date 5/8/2018 
Target
Name:
Toll-like receptor 7
Synonyms:
ORF Names:UNQ248/PRO285 TLR7_HUMAN | Toll-like receptor 7 (TLR7)
Type:
Enzyme
Mol. Mass.:
120945.35
Organism:
Homo sapiens (Human)
Description:
Q9NYK1
Residue:
1049
  
Inhibitor
Name:
BDBM393034
Synonyms:
2-butoxy-7-((5-(pyrrolidine-1-ylmethyl)pyridine-2-yl)methyl)-5H-pyrrolo[3,2-d]pyrimidine-4-amine | US9962388, Compound Example 40
Type:
Small organic molecule
Emp. Form.:
C21H28N6O
Mol. Mass.:
380.4866
SMILES:
CCCCOc1nc(N)c2[nH]cc(Cc3ccc(CN4CCCC4)cn3)c2n1
: