Target
Toll-like receptor 7
Ligand
BDBM393036
Substrate
Meas. Tech.
In Vitro Receptor Binding Activity Screening Assay
EC50
0.50±n/a nM
Citation
 Ding, ZWu, HSun, FWu, LYang, L Pyrrolopyrimidine compounds used as TLR7 agonist US Patent  US9962388 Publication Date 5/8/2018 
Target
Name:
Toll-like receptor 7
Synonyms:
ORF Names:UNQ248/PRO285 TLR7_HUMAN | Toll-like receptor 7 (TLR7)
Type:
Enzyme
Mol. Mass.:
120945.35
Organism:
Homo sapiens (Human)
Description:
Q9NYK1
Residue:
1049
  
Inhibitor
Name:
BDBM393036
Synonyms:
4-amino-2-butoxy-7-(4-(pyrrolidine-1-ylmethyl)benzyl)-5H-pyrrolo[3,2-d]pyrimidine-6-carbonitrile | US9962388, Compound Example 42
Type:
Small organic molecule
Emp. Form.:
C23H28N6O
Mol. Mass.:
404.508
SMILES:
CCCCOc1nc(N)c2[nH]c(C#N)c(Cc3ccc(CN4CCCC4)cc3)c2n1
: