Target
Metabotropic glutamate receptor 3
Ligand
BDBM393737
Substrate
Meas. Tech.
In Vitro GIRK Thallium Flux Assay (2.5 minutes)
EC50
>30000±n/a nM
Citation
 Cosford, NDRaveendra-Panickar, DSheffler, DJ Metabotropic glutamate receptor negative allosteric modulators (NAMS) and uses thereof US Patent  US9969726 Publication Date 5/15/2018 
Target
Name:
Metabotropic glutamate receptor 3
Synonyms:
GRM3_RAT Grm3 glutamate receptor, metabotropic 3 precursor
Type:
Protein
Mol. Mass.:
98971.84
Organism:
Rattus norvegicus (Rat)
Description:
P31422
Residue:
879
  
Inhibitor
Name:
BDBM393737
Synonyms:
US10597367, Example 27 | US9969726, Example 27
Type:
Small organic molecule
Emp. Form.:
C15H10FNS
Mol. Mass.:
255.31
SMILES:
Fc1ccc(cc1)-c1csc(n1)-c1ccccc1
: