Target
Metabotropic glutamate receptor 3
Ligand
BDBM393805
Substrate
Meas. Tech.
In Vitro GIRK Thallium Flux Assay (60 minutes)
EC50
2310±n/a nM
Citation
 Cosford, NDRaveendra-Panickar, DSheffler, DJ Metabotropic glutamate receptor negative allosteric modulators (NAMS) and uses thereof US Patent  US9969726 Publication Date 5/15/2018 
Target
Name:
Metabotropic glutamate receptor 3
Synonyms:
GRM3_RAT Grm3 glutamate receptor, metabotropic 3 precursor
Type:
Protein
Mol. Mass.:
98971.84
Organism:
Rattus norvegicus (Rat)
Description:
P31422
Residue:
879
  
Inhibitor
Name:
BDBM393805
Synonyms:
US10597367, Example 93 | US9969726, Example 93
Type:
Small organic molecule
Emp. Form.:
C26H18F4N2O2
Mol. Mass.:
466.4269
SMILES:
Cc1cc(C)cc(c1)-c1cc(nc(n1)-c1cccc(c1)-c1ccc(F)c(c1)C(O)=O)C(F)(F)F
: