Target
Interleukin-1 receptor-associated kinase 4
Ligand
BDBM393939
Substrate
Meas. Tech.
Kinase Assay
IC50
9.00±n/a nM
Citation
 Altman, MDAndresen, BMBrubaker, JDChilders, MLDonofrio, AFischmann, TGibeau, CRKattar, SDLesburg, CALim, JMacLean, JKMansoor, UFNorthrup, ABSanders, JMTorres, L Inhibitors of IRAK4 activity US Patent  US9969749 Publication Date 5/15/2018 
Target
Name:
Interleukin-1 receptor-associated kinase 4
Synonyms:
IRAK-4 IRAK4_HUMAN Interleukin-1 receptor-associated kinase 4 (IRAK4) | Renal carcinoma antigen NY-REN-64
Type:
Protein
Mol. Mass.:
51519.08
Organism:
Homo sapiens (Human)
Description:
Q9NWZ3
Residue:
460
  
Inhibitor
Name:
BDBM393939
Synonyms:
US9969749, Example 1-32 | trans-N'-6-(isoxazol-4- yl)quinazolin-4-yl]-N,N- dimethylcyclohexane- 1,4-diamine
Type:
Small organic molecule
Emp. Form.:
C19H25N5O
Mol. Mass.:
339.4347
SMILES:
CN(C)[C@H]1CC[C@@H](CC1)Nc1ncnc2ccc(cc12)C(=C\O)\C=N
: