Target
Interleukin-1 receptor-associated kinase 4
Ligand
BDBM393975
Substrate
Meas. Tech.
Kinase Assay
IC50
5.00±n/a nM
Citation
 Altman, MDAndresen, BMBrubaker, JDChilders, MLDonofrio, AFischmann, TGibeau, CRKattar, SDLesburg, CALim, JMacLean, JKMansoor, UFNorthrup, ABSanders, JMTorres, L Inhibitors of IRAK4 activity US Patent  US9969749 Publication Date 5/15/2018 
Target
Name:
Interleukin-1 receptor-associated kinase 4
Synonyms:
IRAK-4 IRAK4_HUMAN Interleukin-1 receptor-associated kinase 4 (IRAK4) | Renal carcinoma antigen NY-REN-64
Type:
Protein
Mol. Mass.:
51519.08
Organism:
Homo sapiens (Human)
Description:
Q9NWZ3
Residue:
460
  
Inhibitor
Name:
BDBM393975
Synonyms:
3-fluoro-5-{4-[(trans- 4-morpholin-4- ylcyclohexyl)amino] quinazolin-6-yl}phenol | US9969749, Example 1-66
Type:
Small organic molecule
Emp. Form.:
C24H27FN4O2
Mol. Mass.:
422.4952
SMILES:
Oc1cc(F)cc(c1)-c1ccc2ncnc(N[C@H]3CC[C@@H](CC3)N3CCOCC3)c2c1
: