Target
Interleukin-1 receptor-associated kinase 4
Ligand
BDBM394028
Substrate
Meas. Tech.
Kinase Assay
IC50
48.0±n/a nM
Citation
 Altman, MDAndresen, BMBrubaker, JDChilders, MLDonofrio, AFischmann, TGibeau, CRKattar, SDLesburg, CALim, JMacLean, JKMansoor, UFNorthrup, ABSanders, JMTorres, L Inhibitors of IRAK4 activity US Patent  US9969749 Publication Date 5/15/2018 
Target
Name:
Interleukin-1 receptor-associated kinase 4
Synonyms:
IRAK-4 IRAK4_HUMAN Interleukin-1 receptor-associated kinase 4 (IRAK4) | Renal carcinoma antigen NY-REN-64
Type:
Protein
Mol. Mass.:
51519.08
Organism:
Homo sapiens (Human)
Description:
Q9NWZ3
Residue:
460
  
Inhibitor
Name:
BDBM394028
Synonyms:
6-(2,3-dihydro-1H- pyrrolo[3,2-b]pyridin-6- yl)-N-[trans-4- (morpholin-4- yl)cyclohexyl]quinazolin- 4-amine | US9969749, Example 2-16
Type:
Small organic molecule
Emp. Form.:
C25H30N6O
Mol. Mass.:
430.5453
SMILES:
C1Cc2ncc(cc2N1)-c1ccc2ncnc(N[C@H]3CC[C@@H](CC3)N3CCOCC3)c2c1
: