Target
Interleukin-1 receptor-associated kinase 4
Ligand
BDBM394061
Substrate
Meas. Tech.
Kinase Assay
IC50
2.00±n/a nM
Citation
 Altman, MDAndresen, BMBrubaker, JDChilders, MLDonofrio, AFischmann, TGibeau, CRKattar, SDLesburg, CALim, JMacLean, JKMansoor, UFNorthrup, ABSanders, JMTorres, L Inhibitors of IRAK4 activity US Patent  US9969749 Publication Date 5/15/2018 
Target
Name:
Interleukin-1 receptor-associated kinase 4
Synonyms:
IRAK-4 IRAK4_HUMAN Interleukin-1 receptor-associated kinase 4 (IRAK4) | Renal carcinoma antigen NY-REN-64
Type:
Protein
Mol. Mass.:
51519.08
Organism:
Homo sapiens (Human)
Description:
Q9NWZ3
Residue:
460
  
Inhibitor
Name:
BDBM394061
Synonyms:
6-[5- (methylamino)pyridin-3- yl]-N-{trans-4-[(3R)-3- (morpholin-4- ylmethyl)piperidin-1- yl]cyclohexyl}quinazolin- 4-amine | US9969749, Example 5-11
Type:
Small organic molecule
Emp. Form.:
C30H41N7O
Mol. Mass.:
515.6928
SMILES:
CNc1cncc(c1)-c1ccc2ncnc(N[C@H]3CC[C@@H](CC3)N3CCC[C@H](CN4CCOCC4)C3)c2c1
: