Target
Pantetheinase
Ligand
BDBM395108
Substrate
Meas. Tech.
Human Vanin-1 Enzyme Assay 2
IC50
11.3±n/a nM
Citation
 Casimiro-Garcia, ACondon, JSFlick, ACGopalsamy, AKirincich, SJMathias, JPStrobach, JWXiang, JSXing, LHWang, X Heterocyclic compounds as inhibitors of Vanin-1 enzyme US Patent  US10308615 Publication Date 6/4/2019 
Target
Name:
Pantetheinase
Synonyms:
Pantetheine hydrolase VNN1 Vanin-1 | Vascular non-inflammatory molecule 1
Type:
Enzyme Catalytic Domain
Mol. Mass.:
57002.46
Organism:
Homo sapiens (Human)
Description:
O95497
Residue:
513
  
Inhibitor
Name:
BDBM395108
Synonyms:
US10308615, Example 119 | {2-[(pyrimidin-5- ylmethyl)amino] pyrimidin-5-yl}[3- (trifluoromethyl) phenyl]methanone
Type:
Small organic molecule
Emp. Form.:
C17H12F3N5O
Mol. Mass.:
359.3053
SMILES:
FC(F)(F)c1cccc(c1)C(=O)c1cnc(NCc2cncnc2)nc1
: