Target
Mitogen-activated protein kinase kinase kinase 8
Ligand
BDBM29926
Substrate
Dual specificity mitogen-activated protein kinase kinase 1
Meas. Tech.
Tpl2/Cot ELISA Assay
IC50
10±n/a nM
Citation
 Wu, JGreen, NHotchandani, RHu, YCondon, JHuang, AKaila, NLi, HQGuler, SLi, WTam, SYWang, QPelker, JMarusic, SHsu, SPerry Hall, JTelliez, JBCui, JLin, LL Selective inhibitors of tumor progression loci-2 (Tpl2) kinase with potent inhibition of TNF-alpha production in human whole blood. Bioorg Med Chem Lett 19:3485-8 (2009)  
Target
Name:
Mitogen-activated protein kinase kinase kinase 8
Synonyms:
C-COT COT proto-oncogene serine/threonine-protein kinase ESTF MAP3K8 Tumor Progression Loci-2 Kinase (COT) | Tumor progression locus 2
Type:
Serine/threonine-protein kinase
Mol. Mass.:
52916.89
Organism:
Homo sapiens (Human)
Description:
P41279
Residue:
467
  
Inhibitor
Name:
BDBM29926
Synonyms:
substituted 6-aminoquinoline-3-carbonitrile, 37
Type:
Small organic molecule
Emp. Form.:
C28H27Cl2FN8
Mol. Mass.:
565.472
SMILES:
Fc1ccc(Nc2c(cnc3c(Cl)cc(NCc4cn(nn4)C4CCN(CC4)C4CCC4)cc23)C#N)cc1Cl
:
Substrate
Name:
Dual specificity mitogen-activated protein kinase kinase 1
Synonyms:
GST fusion of MAP kinase kinase 1 MAP2K1 MP2K1_RABIT glutathione S-transferase-MAP kinase kinase 1
Type:
Other Protein Type
Mol. Mass.:
43453
Organism:
Oryctolagus cuniculus (rabbit)
Description:
Rabbit MEK1 was purchased from Millipore.
Residue:
393