Target
Orexin receptor type 2
Ligand
BDBM395698
Substrate
Meas. Tech.
FLIPR assay
IC50
146±n/a nM
Citation
 Liverton, NKuduk, SDLuo, YMeng, NYu, T Piperidine oxadiazole and thiadiazole orexin receptor antagonists US Patent  US10308645 Publication Date 6/4/2019 
Target
Name:
Orexin receptor type 2
Synonyms:
HCRTR2 OX2R_HUMAN Orexin receptor type 2 (OR-2) Orexin receptor type 2 (OX2R) Ox-2-R | Ox2-R
Type:
Protein
Mol. Mass.:
50710.53
Organism:
Homo sapiens (Human)
Description:
O43614
Residue:
444
  
Inhibitor
Name:
BDBM395698
Synonyms:
2-(3-{(3R,6R)-1-[(2- ethoxyphenyl)carbonyl]-6- methylpiperidin-3-yl}-1,2,4- thiadiazol-5-yl)propan-2-ol | US10308645, Example 37
Type:
Small organic molecule
Emp. Form.:
C20H27N3O3S
Mol. Mass.:
389.512
SMILES:
CCOc1ccccc1C(=O)N1C[C@@H](CC[C@H]1C)c1nsc(n1)C(C)(C)O
: