Target
Substance-P receptor
Ligand
BDBM242767
Substrate
Meas. Tech.
Inhibition Assay
Ki
>30000±n/a nM
Citation
 Hoveyda, HDutheuil, GFraser, G N-acyl-(3-substituted)-(8-substituted)-5,6-dihydro-[1,2,4]triazolo[4,3-a]pyrazines as selective NK-3 receptor antagonists US Patent  US9987274 Publication Date 6/5/2018 
Target
Name:
Substance-P receptor
Synonyms:
NK-1 receptor NK1 Receptor NK1R_HUMAN Neurokinin-1 (NK-1) SPR TACR1 Tachykinin receptor 1 (NK1) | tachykinin
Type:
G Protein-Coupled Receptor (GPCR)
Mol. Mass.:
46254.43
Organism:
Homo sapiens (Human)
Description:
P25103
Residue:
407
  
Inhibitor
Name:
BDBM242767
Synonyms:
US10030025, Compound 33 US11731974, Compound 33 US9987274, Compound 33
Type:
Small organic molecule
Emp. Form.:
C16H13F3N6OS
Mol. Mass.:
394.374
SMILES:
CC1N(CCn2c1nnc2-c1nc(C)ns1)C(=O)c1ccc(F)c(F)c1F
: