Target
3-phosphoinositide-dependent protein kinase 1 [48-359]
Ligand
BDBM32437
Substrate
Serine/threonine-protein kinase Sgk1
Meas. Tech.
ELISA assay
pH
7.4±n/a
Temperature
296.15±n/a K
IC50
65±n/a nM
Citation
 Kim, KHWissner, AFloyd, MBFraser, HLWang, YDDushin, RGHu, YOlland, AGuo, BArndt, K Benzo[c][2,7]naphthyridines as inhibitors of PDK-1. Bioorg Med Chem Lett 19:5225-8 (2009)  
Target
Name:
3-phosphoinositide-dependent protein kinase 1 [48-359]
Synonyms:
3-Phosphoinositide-Dependent Protein Kinase 1 (PDK1) PDK1 PDPK1_HUMAN | hPDK1
Type:
Serine/threonine-protein kinase
Mol. Mass.:
35527.50
Organism:
Homo sapiens (Human)
Description:
O15530[48-359]
Residue:
312
  
Inhibitor
Name:
BDBM32437
Synonyms:
Benzo[c][2,7]naphthyridine, 30
Type:
Small organic molecule
Emp. Form.:
C19H15BrN4O2
Mol. Mass.:
411.252
SMILES:
COc1cc2ncc3c(N)nc(cc3c2cc1OC)-c1cncc(Br)c1
:
Substrate
Name:
Serine/threonine-protein kinase Sgk1
Synonyms:
SGK SGK1_HUMAN Serine/threonine-protein kinase Sgk1 (SGK) Serum/glucocorticoid-regulated kinase 1 (SGK1)
Type:
Other Protein Type
Mol. Mass.:
48954.40
Organism:
Homo sapiens (Human)
Description:
Recombinant human SGK-1 enzyme produced in a baculovirus system.
Residue:
431