Target
Broad substrate specificity ATP-binding cassette transporter ABCG2
Ligand
BDBM32626
Substrate
BDBM32618
Meas. Tech.
Screening Assay for ABCG2 Inhibitors
pH
7.4±n/a
Temperature
310.15±n/a K
IC50
41400±6100 nM
Comments
Max activity (% FTC)=71.3 +/- 5.6.
Citation
 Henrich, CJRobey, RWTakada, KBokesch, HRBates, SEShukla, SAmbudkar, SVMcMahon, JBGustafson, KR Botryllamides: Natural Product Inhibitors of ABCG2. ACS Chem Biol 4:637-47 (2009)  
Target
Name:
Broad substrate specificity ATP-binding cassette transporter ABCG2
Synonyms:
ABCG2 ABCP ATP-binding cassette sub-family G member 2 ATP-binding cassette, sub-family G, member 2 BCRP1 CDw338 Mitoxantrone resistance-associated protein Urate exporter
Type:
Multi-pass membrane protein; monomer or homodimer; disulfide-linked
Mol. Mass.:
72329.48
Organism:
Homo sapiens (Human)
Description:
Q9UNQ0
Residue:
655
  
Inhibitor
Name:
BDBM32626
Synonyms:
Botryllamide I, 9
Type:
Small organic molecule
Emp. Form.:
C19H19NO4
Mol. Mass.:
325.3585
SMILES:
CO\C(=C\c1ccc(O)cc1)C(=O)N\C=C\c1ccc(OC)cc1
:
Substrate
Name:
BDBM32618
Synonyms:
NSC75783 pheophorbide a
Type:
Emp. Form.:
C35H36N4O5
Mol. Mass.:
592.6841
SMILES:
CCc1c(C)c2cc3[nH]c(cc4nc([C@@H](CCC(O)=O)[C@@H]4C)c4c(C(=O)OC)c(O)c5c(C)c(cc1[nH]2)nc45)c(C)c3C=C
: