Target
Bile acid receptor
Ligand
BDBM399988
Substrate
Meas. Tech.
Human FXR (NR1H4) Assay
EC50
<100±n/a nM
Citation
 Or, YSXing, XWang, GShen, RHe, J Benzoic acid derivatives of bile acid as FXR/TGR5 agonists and methods of use thereof US Patent  US10323060 Publication Date 6/18/2019 
Target
Name:
Bile acid receptor
Synonyms:
BAR FXR HRR1 NR1H4_HUMAN RIP14 Retinoid X receptor-interacting protein 14 | farnesoid x receptor
Type:
Nuclear Receptor
Mol. Mass.:
55916.24
Organism:
Homo sapiens (Human)
Description:
Q96RI1
Residue:
486
  
Inhibitor
Name:
BDBM399988
Synonyms:
US10323060, Example 1 | US10323060, Example 2
Type:
Small organic molecule
Emp. Form.:
C34H50O4
Mol. Mass.:
522.7584
SMILES:
CC[C@H]1[C@@H](O)[C@H]2[C@@H]3CC[C@H]([C@H](C)C\C=C\c4ccccc4C(=O)OC)[C@@]3(C)CC[C@@H]2[C@@]2(C)CC[C@@H](O)C[C@@H]12
: