Target
Epidermal growth factor receptor
Ligand
BDBM33395
Substrate
BDBM10852
Meas. Tech.
Phosphotyrosine (PY) ELISA
pH
7.4±n/a
Temperature
310.15±n/a K
IC50
>200000±n/a nM
Citation
 Gangjee, ALi, WLin, LZeng, YIhnat, MWarnke, LAGreen, DWCody, VPace, JQueener, SF Design, synthesis, and X-ray crystal structures of 2,4-diaminofuro[2,3-d]pyrimidines as multireceptor tyrosine kinase and dihydrofolate reductase inhibitors. Bioorg Med Chem 17:7324-36 (2009)  
Target
Name:
Epidermal growth factor receptor
Synonyms:
EGF Receptor Substrate EGFR_HUMAN ERBB1 Epidermal Growth Factor Receptor erbB-1 Epidermal growth factor receptor (EGFR) HER1 Proto-oncogene c-ErbB-1 Tyrosine-Protein Kinase ErbB-1
Type:
Receptor Kinase Domain
Mol. Mass.:
134279.59
Organism:
Homo sapiens (Human)
Description:
P00533
Residue:
1210
  
Inhibitor
Name:
BDBM33395
Synonyms:
2,4-diaminofuro[2,3-d]pyrimidine, 1b | Z-isomer
Type:
Small organic molecule
Emp. Form.:
C16H16N4O2
Mol. Mass.:
296.3238
SMILES:
COc1ccccc1\C(C)=C/c1coc2nc(N)nc(N)c12
:
Substrate