Target
Dihydrofolate reductase
Ligand
BDBM33394
Substrate
BDBM18044
Meas. Tech.
Phosphotyrosine (PY) ELISA
IC50
14500±n/a nM
Citation
 Gangjee, ALi, WLin, LZeng, YIhnat, MWarnke, LAGreen, DWCody, VPace, JQueener, SF Design, synthesis, and X-ray crystal structures of 2,4-diaminofuro[2,3-d]pyrimidines as multireceptor tyrosine kinase and dihydrofolate reductase inhibitors. Bioorg Med Chem 17:7324-36 (2009)  
Target
Name:
Dihydrofolate reductase
Synonyms:
DYR_MOUSE | Dhfr
Type:
Enzyme
Mol. Mass.:
21608.82
Organism:
Mus musculus (Mouse)
Description:
Residue:
187
  
Inhibitor
Name:
BDBM33394
Synonyms:
2,4-diaminofuro[2,3-d]pyrimidine, 1a | E-isomer
Type:
Small organic molecule
Emp. Form.:
C16H16N4O2
Mol. Mass.:
296.3238
SMILES:
COc1ccccc1\C(C)=C\c1coc2nc(N)nc(N)c12
:
Substrate
Name:
BDBM18044
Synonyms:
(2S)-2-[(4-{[(2-amino-4-oxo-1,4,7,8-tetrahydropteridin-6-yl)methyl]amino}phenyl)formamido]pentanedioic acid dihydrofolic acid
Type:
Small organic molecule
Emp. Form.:
C19H21N7O6
Mol. Mass.:
443.4133
SMILES:
Nc1nc2NCC(CNc3ccc(cc3)C(=O)N[C@@H](CCC(O)=O)C(O)=O)=Nc2c(=O)[nH]1
: