Target
G-protein coupled receptor 6
Ligand
BDBM400608
Substrate
Meas. Tech.
Inhibition of cAMP Activity of GPR6 In Vitro Assay
EC50
123000±n/a nM
Citation
 Adams, MEBrown, JWHitchcock, SHopkins, MKikuchi, SLam, BMonenschein, HReichard, HSun, H Pyrazines as modulators of GPR6 US Patent  US10000468 Publication Date 6/19/2018 
Target
Name:
G-protein coupled receptor 6
Synonyms:
G-protein coupled receptor 6 (GPR6) GPR6_HUMAN | Sphingosine 1-phosphate receptor GPR6
Type:
Protein
Mol. Mass.:
37886.39
Organism:
Homo sapiens (Human)
Description:
P46095
Residue:
362
  
Inhibitor
Name:
BDBM400608
Synonyms:
US10000468, Example 15 | US10000468, Example 16
Type:
Small organic molecule
Emp. Form.:
C22H26F2N6O2
Mol. Mass.:
444.4776
SMILES:
CC(C)Nc1nc(C(=O)N(C)C)c(nc1N1CCC(CC1)Oc1ccc(F)cc1F)C#N
: