Target
Protein kinase C zeta type
Ligand
BDBM35173
Substrate
Biotinylated Peptide Substrate
Meas. Tech.
PKC Enzyme Assay
pH
7.5±n/a
Temperature
296.15±n/a K
IC50
5.18±n/a nM
Citation
 Trujillo, JIKiefer, JRHuang, WThorarensen, AXing, LCaspers, NLDay, JEMathis, KJKretzmer, KKReitz, BAWeinberg, RAStegeman, RAWrightstone, AChristine, LCompton, RLi, X 2-(6-Phenyl-1H-indazol-3-yl)-1H-benzo[d]imidazoles: design and synthesis of a potent and isoform selective PKC-zeta inhibitor. Bioorg Med Chem Lett 19:908-11 (2009)  
Target
Name:
Protein kinase C zeta type
Synonyms:
KPCZ_HUMAN PRKCZ Protein kinase C (PKC) Protein kinase C zeta Protein kinase C zeta type Protein kinase C zeta type (PKCzeta) | nPKC-zeta
Type:
Enzyme
Mol. Mass.:
67649.13
Organism:
Homo sapiens (Human)
Description:
Residue:
592
  
Inhibitor
Name:
BDBM35173
Synonyms:
indazole-benzimidazole, 9
Type:
Small organic molecule
Emp. Form.:
C25H25N7
Mol. Mass.:
423.5129
SMILES:
CN1CCN(CC1)c1cccc2[nH]c(nc12)-c1n[nH]c2cc(ccc12)-c1ccc(N)cc1
:
Substrate
Name:
Biotinylated Peptide Substrate
Synonyms:
Type:
Peptide
Mol. Mass.:
3052.46
Organism:
Description:
Residue:
24