Target
Metabotropic glutamate receptor 4
Ligand
BDBM88361
Substrate
Meas. Tech.
Ca2+ Mobilization Assay
EC50
180±n/a nM
Citation
 Biemans, BGuba, WJaeschke, GRicci, ARueher, DVieira, E Ethynyl derivatives US Patent  US9695128 Publication Date 7/4/2017 
Target
Name:
Metabotropic glutamate receptor 4
Synonyms:
GPRC1D GRM4_HUMAN MGLUR4 Metabotropic glutamate receptor 4 (mGlu4) metabotropic glutamate 4
Type:
Protein
Mol. Mass.:
101899.95
Organism:
Homo sapiens (Human)
Description:
Q14833
Residue:
912
  
Inhibitor
Name:
BDBM88361
Synonyms:
US9695128, 11
Type:
Small organic molecule
Emp. Form.:
C21H17ClFN3O2
Mol. Mass.:
397.83
SMILES:
CC1CCCC2N1C(=O)N(C2=O)c1c(F)cc(cc1Cl)C#Cc1cccnc1
: