Target
Phosphatidylinositol 4,5-bisphosphate 3-kinase catalytic subunit gamma isoform
Ligand
BDBM36522
Substrate
Meas. Tech.
Biochemical Assay
pH
7.5±0
Temperature
310.15±0 K
IC50
>1e+3±n/a nM
Citation
 Xie, PWilliams, DSAtilla-Gokcumen, GEMilk, LXiao, MSmalley, KSHerlyn, MMeggers, EMarmorstein, R Structure-based design of an organoruthenium phosphatidyl-inositol-3-kinase inhibitor reveals a switch governing lipid kinase potency and selectivity. ACS Chem Biol 3:305-16 (2008)  
Target
Name:
Phosphatidylinositol 4,5-bisphosphate 3-kinase catalytic subunit gamma isoform
Synonyms:
PI3-kinase p110 subunit gamma PI3Kgamma PK3CG_HUMAN Phosphatidylinositol 4,5-bisphosphate 3-kinase (PI3K) Phosphatidylinositol 4,5-bisphosphate 3-kinase catalytic subunit gamma (PI3Kgamma) Phosphatidylinositol 4,5-bisphosphate 3-kinase catalytic subunit gamma isoform (PI3K) Phosphatidylinositol-4,5-bisphosphate 3-kinase catalytic subunit gamma isoform Phosphoinositide 3-kinases gamma (PI3K gamma) p120-PI3K
Type:
Enzyme Subunit
Mol. Mass.:
126470.30
Organism:
Homo sapiens (Human)
Description:
P48736
Residue:
1102
  
Inhibitor
Name:
BDBM36522
Synonyms:
HB12
Type:
Small organic molecule
Emp. Form.:
C18H8N3O3Ru
Mol. Mass.:
415.34
SMILES:
O=C1NC(=O)c2c1c1c3ccccc3n3[Ru](C#[O])[n+]4cccc2c4c13
: