Target
Cholesteryl ester transfer protein
Ligand
BDBM264531
Substrate
Meas. Tech.
Radioactive Assays of CETP-Catalyzed CE and TG Transfer (RTA Assay)
IC50
361±n/a nM
Citation
 Ondeyka, DQian, XVachal, PTyagarajan, SSmith, CJLi, HBao, J Spirocyclic CETP inhibitors US Patent  US9717714 Publication Date 8/1/2017 
Target
Name:
Cholesteryl ester transfer protein
Synonyms:
CETP Cholesteryl ester transfer protein (CETP) | Lipid transfer protein I
Type:
Enzyme
Mol. Mass.:
54751.53
Organism:
Homo sapiens (Human)
Description:
P11597
Residue:
493
  
Inhibitor
Name:
BDBM264531
Synonyms:
(7R)-7-[3,5- bis(trifluoromethyl)phenyl]- 4-{[4'-fluoro-2'-methoxy-5'- (1-methylethyl)-4- (trifluoromethyl)biphenyl-2- yl]methyl}-6-oxa-4- azaspiro[2.4]heptan-5-one | US9717714, 19
Type:
Small organic molecule
Emp. Form.:
C31H25F10NO3
Mol. Mass.:
649.5191
SMILES:
COc1cc(F)c(cc1-c1ccc(cc1CN1C(=O)O[C@H](c2cc(cc(c2)C(F)(F)F)C(F)(F)F)C11CC1)C(F)(F)F)C(C)C
: