Target
Beta-secretase 1
Ligand
BDBM195506
Substrate
Meas. Tech.
BACE Assay
IC50
2.40±n/a nM
Citation
 Cacatian, SClaremon, DADillard, LWFuchs, KHeine, NJia, LLeftheris, KMcKeever, BMorales-Ramos, ASingh, SBVenkatraman, SWu, GWu, ZXu, ZYuan, JZheng, Y Inhibitors of beta-secretase US Patent  US10336717 Publication Date 7/2/2019 
Target
Name:
Beta-secretase 1
Synonyms:
ASP2 Aspartyl protease 2 BACE1 Beta-secretase (BACE) Beta-secretase 1 (BACE 1) Beta-secretase 1 (BACE1) Beta-site amyloid precursor protein cleaving enzyme 1 Memapsin-2 beta-Secretase (BACE-1) | beta-Secretase (BACE1)
Type:
Protein
Mol. Mass.:
55755.10
Organism:
Homo sapiens (Human)
Description:
P56817
Residue:
501
  
Inhibitor
Name:
BDBM195506
Synonyms:
US10336717, Compound 99 | US9212153, 99,Ex. 65
Type:
Small organic molecule
Emp. Form.:
C22H25F2N3O2
Mol. Mass.:
401.4496
SMILES:
CN1OC2(N=C1N)c1cc(ccc1CC21CCC(CC1)OC(F)F)C#CC1CC1
: