Target
Heat shock protein HSP 90-alpha
Ligand
BDBM20908
Substrate
Meas. Tech.
Fluorescence Polarization Assay
IC50
<10000±n/a nM
Citation
 Drysdale, MJDymock, BWFinch, HWebb, PMcDonald, EJames, KECheung, KMMatthews, TP Isoxazole compounds as inhibitors of heat shock proteins US Patent  US9718793 Publication Date 8/1/2017 
Target
Name:
Heat shock protein HSP 90-alpha
Synonyms:
HS90A_HUMAN HSP86 HSP90AA1 HSPCA Heat shock 86 kDa Heat shock protein HSP 90-alpha (HSP90) LAP-2 Lipopolysaccharide-associated protein 2 heat shock protein 90kDa alpha (cytosolic), class A member 1 isoform 2
Type:
Molecular Chaperone
Mol. Mass.:
84623.45
Organism:
Homo sapiens (Human)
Description:
P07900
Residue:
732
  
Inhibitor
Name:
BDBM20908
Synonyms:
5-(5-chloro-2,4-dihydroxyphenyl)-4-{4-[(dimethylamino)methyl]phenyl}-N-ethyl-1,2-oxazole-3-carboxamide US10413550, Example 59 US9718793, 59
Type:
Small organic molecule
Emp. Form.:
C21H22ClN3O4
Mol. Mass.:
415.87
SMILES:
CCNC(=O)c1noc(c1-c1ccc(CN(C)C)cc1)-c1cc(Cl)c(O)cc1O
: