Target
Heat shock protein HSP 90-alpha
Ligand
BDBM265401
Substrate
Meas. Tech.
Malachite Green ATPase assay
IC50
<10000±n/a nM
Citation
 Drysdale, MJDymock, BWFinch, HWebb, PMcDonald, EJames, KECheung, KMMatthews, TP Isoxazole compounds as inhibitors of heat shock proteins US Patent  US9718793 Publication Date 8/1/2017 
Target
Name:
Heat shock protein HSP 90-alpha
Synonyms:
HS90A_HUMAN HSP86 HSP90AA1 HSPCA Heat shock 86 kDa Heat shock protein HSP 90-alpha (HSP90) LAP-2 Lipopolysaccharide-associated protein 2 heat shock protein 90kDa alpha (cytosolic), class A member 1 isoform 2
Type:
Molecular Chaperone
Mol. Mass.:
84623.45
Organism:
Homo sapiens (Human)
Description:
P07900
Residue:
732
  
Inhibitor
Name:
BDBM265401
Synonyms:
US10413550, Example 78u US9718793, 78u
Type:
Small organic molecule
Emp. Form.:
C27H35N3O4
Mol. Mass.:
465.5845
SMILES:
CCN(CC)Cc1ccc(cc1)-c1c(noc1-c1cc(C(C)C)c(O)cc1O)C(=O)NC(C)C
: