Target
Heat shock protein HSP 90-alpha
Ligand
BDBM265437
Substrate
Meas. Tech.
Malachite Green ATPase assay
IC50
78000±n/a nM
Citation
 Drysdale, MJDymock, BWFinch, HWebb, PMcDonald, EJames, KECheung, KMMatthews, TP Isoxazole compounds as inhibitors of heat shock proteins US Patent  US9718793 Publication Date 8/1/2017 
Target
Name:
Heat shock protein HSP 90-alpha
Synonyms:
HS90A_HUMAN HSP86 HSP90AA1 HSPCA Heat shock 86 kDa Heat shock protein HSP 90-alpha (HSP90) LAP-2 Lipopolysaccharide-associated protein 2 heat shock protein 90kDa alpha (cytosolic), class A member 1 isoform 2
Type:
Molecular Chaperone
Mol. Mass.:
84623.45
Organism:
Homo sapiens (Human)
Description:
P07900
Residue:
732
  
Inhibitor
Name:
BDBM265437
Synonyms:
US10413550, Example 78ai US9718793, 78ai
Type:
Small organic molecule
Emp. Form.:
C32H41N5O7
Mol. Mass.:
607.6972
SMILES:
CCNC(=O)Oc1cc(OC(=O)NCC)c(cc1C(C)C)-c1onc(C(=O)NCC)c1-c1ccc(CN2CCOCC2)cc1
: