Target
Multidrug resistance-associated protein 1
Ligand
BDBM38462
Substrate
Meas. Tech.
Identification of Molecular Probes that Activate MRP-1 - Dose Response
EC50
6069±n/a nM
Citation
 PubChem, PC Identification of Molecular Probes that Activate MRP-1 - Dose Response PubChem Bioassay (2007)[AID] 
Target
Name:
Multidrug resistance-associated protein 1
Synonyms:
7.6.2.2 ABCC1 ATP-binding cassette, sub-family C, member 1 isoform 1 LTC4 transporter MRP MRP1_HUMAN
Type:
Mol. Mass.:
171597.72
Organism:
Homo sapiens (Human)
Description:
P33527
Residue:
1531
  
Inhibitor
Name:
BDBM38462
Synonyms:
5-chloranyl-2-methylsulfanyl-N-(5-methylsulfanyl-1,3,4-thiadiazol-2-yl)pyrimidine-4-carboxamide 5-chloro-2-(methylthio)-N-[5-(methylthio)-1,3,4-thiadiazol-2-yl]pyrimidine-4-carboxamide MLS000066688 cid_2234677
Type:
Small organic molecule
Emp. Form.:
C9H8ClN5OS3
Mol. Mass.:
333.841
SMILES:
CSc1nnc(NC(=O)c2nc(SC)ncc2Cl)s1
: