Target
Transient receptor potential M8 protein
Ligand
BDBM241618
Substrate
Meas. Tech.
Canine TRPM8 Functional Assay
Temperature
298.15±n/a K
IC50
11.0±n/a nM
Comments
extracted
Citation
 Player, MRCalvo, RChen, JMeegalla, SParks, DJParsons, WJBallentine, SBranum, S Substituted aza-bicyclic imidazole derivatives useful TRPM8 receptor modulators US Patent  US9718820 Publication Date 8/1/2017 
Target
Name:
Transient receptor potential M8 protein
Synonyms:
Cold-menthol receptor (TRPM8) Transient receptor potential M8 protein Transient receptor potential melastatin subfamily, type 8 (TRPM8)
Type:
Enzyme
Mol. Mass.:
127589.43
Organism:
Canis lupus familiaris (Dog)
Description:
Q1A7N1
Residue:
1104
  
Inhibitor
Name:
BDBM241618
Synonyms:
US9409915, 28 | US9718820, Compound 28
Type:
Small organic molecule
Emp. Form.:
C26H29ClF3N7
Mol. Mass.:
532.004
SMILES:
CN1CCN(CC1)c1nc(cc2nc([nH]c12)-c1c(Cl)c(nn1C)C(C)(C)C)-c1ccccc1C(F)(F)F
: