Target
Lysine-specific demethylase 5B
Ligand
BDBM270497
Substrate
Meas. Tech.
Jarid1B Assay
IC50
<100±n/a nM
Citation
 Chen, YKWallace, MB Histone demethylase inhibitors US Patent  US10059687 Publication Date 8/28/2018 
Target
Name:
Lysine-specific demethylase 5B
Synonyms:
CT31 Histone demethylase JARID1B Jumonji/ARID domain-containing protein 1B KDM5B_HUMAN Lysine-specific demethylase 5B (KDM5Flag-5B-FL) PLU1 RBP2-H1 | Retinoblastoma-binding protein 2 homolog 1
Type:
Protein
Mol. Mass.:
175659.67
Organism:
Homo sapiens (Human)
Description:
Q9UGL1
Residue:
1544
  
Inhibitor
Name:
BDBM270497
Synonyms:
3-[({(1R)-6-[2-methyl-4-(2,2,2-tri-fluoroethoxy)phenyl]-1,2,3,4-tetrahydroisoquinolyl}methyl)amino]pyridine-4-carboxylic acid US11001568, Example 2B | US11731954, Example 2B
Type:
Small organic molecule
Emp. Form.:
C25H24F3N3O3
Mol. Mass.:
471.4716
SMILES:
Cc1cc(OCC(F)(F)F)ccc1-c1ccc2[C@H](CNc3cnccc3C(O)=O)NCCc2c1
: