Target
Lysine-specific demethylase 6B
Ligand
BDBM270518
Substrate
Meas. Tech.
JMJD3 Assay
IC50
5500±n/a nM
Citation
 Chen, YKWallace, MB Histone demethylase inhibitors US Patent  US10059687 Publication Date 8/28/2018 
Target
Name:
Lysine-specific demethylase 6B
Synonyms:
JMJD3 Jumonji domain-containing protein 3 KDM6B_HUMAN Lysine demethylase 6B Lysine-specific demethylase 6B (KDM6B(JMJD3)) | Lysine-specific demethylase 6B (KDM6B)
Type:
Protein
Mol. Mass.:
176672.55
Organism:
Homo sapiens (Human)
Description:
O15054
Residue:
1643
  
Inhibitor
Name:
BDBM270518
Synonyms:
(R)-3-(((6-((4-ethylphenyl)(methyl)amino)-2-methyl-1,2,3,4-tetrahydroisoquinolin-1-yl)methyl)amino)isonico-tinic acid US11001568, Example 13A | US11731954, Example 13A and 13B
Type:
Small organic molecule
Emp. Form.:
C26H30N4O2
Mol. Mass.:
430.542
SMILES:
CCc1ccc(cc1)N(C)c1ccc2[C@H](CNc3cnccc3C(O)=O)N(C)CCc2c1
: