Target
Orexin receptor type 2
Ligand
BDBM404269
Substrate
Meas. Tech.
FLIPR Ca2+ Flux Assay
IC50
552±n/a nM
Citation
 Liverton, NKuduk, SDBeshore, DLuo, YMeng, NYu, T Piperidine isoxazole and isothiazole orexin receptor antagonists US Patent  US10017504 Publication Date 7/10/2018 
Target
Name:
Orexin receptor type 2
Synonyms:
HCRTR2 OX2R_HUMAN Orexin receptor type 2 (OR-2) Orexin receptor type 2 (OX2R) Ox-2-R | Ox2-R
Type:
Protein
Mol. Mass.:
50710.53
Organism:
Homo sapiens (Human)
Description:
O43614
Residue:
444
  
Inhibitor
Name:
BDBM404269
Synonyms:
(2-(2H-1,2,3-Triazol-2-yl)phenyl)((2R,5R)-5-(5-(3-hydroxypentan-3-yl)isoxazol-3-yl)-2-methylpiperidin-1-yl)methanone) | US10017504, 8
Type:
Small organic molecule
Emp. Form.:
C23H29N5O3
Mol. Mass.:
423.5081
SMILES:
CCC(O)(CC)c1cc(no1)[C@@H]1CC[C@@H](C)N(C1)C(=O)c1ccccc1-n1nccn1
: