Target
Orexin/Hypocretin receptor type 1
Ligand
BDBM404305
Substrate
Meas. Tech.
FLIPR Ca2+ Flux Assay
IC50
>10000±n/a nM
Citation
 Liverton, NKuduk, SDBeshore, DLuo, YMeng, NYu, T Piperidine isoxazole and isothiazole orexin receptor antagonists US Patent  US10017504 Publication Date 7/10/2018 
Target
Name:
Orexin/Hypocretin receptor type 1
Synonyms:
HCRTR1 OX1R_HUMAN Orexin receptor type 1 (OR 1) Orexin receptor type 1 (OX1) Orexin receptor type 1 (OxR1) | Ox1r
Type:
Protein
Mol. Mass.:
47554.50
Organism:
Homo sapiens (Human)
Description:
O43613
Residue:
425
  
Inhibitor
Name:
BDBM404305
Synonyms:
2-{5-[(3R,6R)-6-Methyl-1-{[2- (2,2,2-trifluoroethoxy) phenyl]carbonyl} piperidin-3-yl]isoxazol-3- yl}propan-2-ol | US10017504, 36
Type:
Small organic molecule
Emp. Form.:
C20H23F3N2O4
Mol. Mass.:
412.4028
SMILES:
CC(C)(O)c1cc(on1)[C@@H]1CCCN(C1)C(=O)c1ccccc1OCC(F)(F)F
: