Target
Orexin/Hypocretin receptor type 1
Ligand
BDBM404310
Substrate
Meas. Tech.
FLIPR Ca2+ Flux Assay
IC50
>10000±n/a nM
Citation
 Liverton, NKuduk, SDBeshore, DLuo, YMeng, NYu, T Piperidine isoxazole and isothiazole orexin receptor antagonists US Patent  US10017504 Publication Date 7/10/2018 
Target
Name:
Orexin/Hypocretin receptor type 1
Synonyms:
HCRTR1 OX1R_HUMAN Orexin receptor type 1 (OR 1) Orexin receptor type 1 (OX1) Orexin receptor type 1 (OxR1) | Ox1r
Type:
Protein
Mol. Mass.:
47554.50
Organism:
Homo sapiens (Human)
Description:
O43613
Residue:
425
  
Inhibitor
Name:
BDBM404310
Synonyms:
US10017504, 41
Type:
Small organic molecule
Emp. Form.:
C20H20F3N5O3
Mol. Mass.:
435.3997
SMILES:
C[C@@H]1CC[C@H](CN1C(=O)c1ccccc1-n1nccn1)c1cc(no1)[C@H](O)C(F)(F)F
: