Target
Orexin/Hypocretin receptor type 1
Ligand
BDBM404316
Substrate
Meas. Tech.
FLIPR Ca2+ Flux Assay
IC50
>10000±n/a nM
Citation
 Liverton, NKuduk, SDBeshore, DLuo, YMeng, NYu, T Piperidine isoxazole and isothiazole orexin receptor antagonists US Patent  US10017504 Publication Date 7/10/2018 
Target
Name:
Orexin/Hypocretin receptor type 1
Synonyms:
HCRTR1 OX1R_HUMAN Orexin receptor type 1 (OR 1) Orexin receptor type 1 (OX1) Orexin receptor type 1 (OxR1) | Ox1r
Type:
Protein
Mol. Mass.:
47554.50
Organism:
Homo sapiens (Human)
Description:
O43613
Residue:
425
  
Inhibitor
Name:
BDBM404316
Synonyms:
(1S)-2,2,2-Trifluoro-1-{5-[(3R,6R)-6- methyl-1-{[2-(2H-tetrazol-2- yl)phenyl]carbonyl}piperidin-3- yl]isoxazol-3-yl}ethanol | US10017504, 47
Type:
Small organic molecule
Emp. Form.:
C19H19F3N6O3
Mol. Mass.:
436.3878
SMILES:
C[C@@H]1CC[C@H](CN1C(=O)c1ccccc1-n1ncnn1)c1cc(no1)[C@H](O)C(F)(F)F
: