Target
Proto-oncogene tyrosine-protein kinase Src
Ligand
BDBM81725
Substrate
Meas. Tech.
Kinase Assay
IC50
73±0.0 nM
Citation
 Shakespeare, WCWang, YBohacek, RKeenan, TSundaramoorthi, RMetcalf, CDilauro, ARoeloffzen, SLiu, SSaltmarsh, JParamanathan, GDalgarno, DNarula, SPradeepan, Svan Schravendijk, MRKeats, JRam, MLiou, SAdams, SWardwell, SBogus, JIuliucci, JWeigele, MXing, LBoyce, BSawyer, TK SAR of carbon-linked, 2-substituted purines: synthesis and characterization of AP23451 as a novel bone-targeted inhibitor of Src tyrosine kinase with in vivo anti-resorptive activity. Chem Biol Drug Des 71:97-105 (2008)  
Target
Name:
Proto-oncogene tyrosine-protein kinase Src
Synonyms:
Neuronal proto-oncogene tyrosine-protein kinase Src SRC_MOUSE Tyrosine-protein kinase SRC
Type:
Protein
Mol. Mass.:
60650.57
Organism:
Mus musculus (Mouse)
Description:
P05480
Residue:
541
  
Inhibitor
Name:
BDBM81725
Synonyms:
2,6,9-Trisubstituted Purine, AP23517
Type:
Small organic molecule
Emp. Form.:
C19H24N6
Mol. Mass.:
336.4341
SMILES:
CCn1cnc2c(Nc3ccccc3)nc(nc12)[C@H]1CC[C@H](N)CC1
: