Target
Glutamate receptor ionotropic, NMDA 1
Ligand
BDBM82062
Substrate
Ki
32±n/a nM
Comments
PDSP_1441
Citation
 Largent, BLGundlach, ALSnyder, SH Pharmacological and autoradiographic discrimination of sigma and phencyclidine receptor binding sites in brain with (+)-[3H]SKF 10,047, (+)-[3H]-3-[3-hydroxyphenyl]-N-(1-propyl)piperidine and [3H]-1-[1-(2-thienyl)cyclohexyl]piperidine. J Pharmacol Exp Ther 238:739-48 (1986) Target
Name:
Glutamate receptor ionotropic, NMDA 1
Synonyms:
Glutamate (NMDA) receptor subunit zeta 1 Glutamate-NMDA-Channel Glutamate-NMDA-Polyamine NMDA Nmdar1 | phencyclidine
Type:
Enzyme Catalytic Domain
Mol. Mass.:
105533.40
Organism:
RAT
Description:
P35439
Residue:
938
  
Inhibitor
Name:
BDBM82062
Synonyms:
PCP,m-NH2
Type:
Emp. Form.:
C17H26N2
Mol. Mass.:
258.4017
SMILES:
Nc1cccc(c1)C1(CCCCC1)N1CCCCC1
: