Target
Ketol-acid reductoisomerase (NADP(+))
Ligand
BDBM82145
Substrate
BDBM82146
Meas. Tech.
Enzyme Inhibition Assay
pH
8±0
Temperature
303.15±0 K
Ki
2.75e+3± 7.2e+2 nM
Citation
 Liu, XHChen, PQWang, BLDong, WLLi, YHXie, XQLi, ZM High throughput receptor-based virtual screening under ZINC database, synthesis, and biological evaluation of ketol-acid reductoisomerase inhibitors. Chem Biol Drug Des 75:228-32 (2010)  
Target
Name:
Ketol-acid reductoisomerase (NADP(+))
Synonyms:
Acetohydroxy-acid isomeroreductase ILVC_ECOLI ilvC
Type:
Enzyme
Mol. Mass.:
54057.85
Organism:
Escherichia coli
Description:
P05793
Residue:
491
  
Inhibitor
Name:
BDBM82145
Synonyms:
N-hydroxy-N-isopropyloxamate, IpOHA
Type:
Small organic molecule
Emp. Form.:
C5H8NO4
Mol. Mass.:
146.1219
SMILES:
CC(C)N(O)C(=O)C([O-])=O
:
Substrate
Name:
BDBM82146
Synonyms:
2-Acetolactate
Type:
Substrate
Emp. Form.:
C5H8O4
Mol. Mass.:
132.1146
SMILES:
CC(=O)C(C)(O)C(O)=O
: