Target
Histone deacetylase 9
Ligand
BDBM272072
Substrate
Meas. Tech.
HDAC9 Biochemicle Assay
IC50
112±n/a nM
Citation
 Dominguez, CMuñoz-Sanjuán, IBürli, RWLuckhurst, CAAllen, DRRaphy, GBreccia, PHaughan, AFWishart, GHughes, SJJarvis, REVater, HDPenrose, SDWall, MStott, AJSaville-Stones, EA Histone deacetylase inhibitors and compositions and methods of use thereof US Patent  US10065948 Publication Date 9/4/2018 
Target
Name:
Histone deacetylase 9
Synonyms:
HD9 HDAC7B HDAC9_HUMAN Histone acetylase 9 (HDAC9) Histone deacetylase 9 (HDAC9) Human HDAC9 MITR
Type:
Enzyme
Mol. Mass.:
111304.31
Organism:
Homo sapiens (Human)
Description:
Q9UKV0
Residue:
1011
  
Inhibitor
Name:
BDBM272072
Synonyms:
(S)-1-(4-Chlorophenyl)-5-(3-fluoro-2-methylphenyl)- N-hydroxy-1,4,5,6-tetrahydrocyclopenta[c]pyrazole-5- carboxamide US10457675, Example 8
Type:
Small organic molecule
Emp. Form.:
C20H17ClFN3O2
Mol. Mass.:
385.819
SMILES:
Cc1c(F)cccc1[C@@]1(Cc2cnn(c2C1)-c1ccc(Cl)cc1)C(=O)NO
: