Target
Glutamate metabotropic receptor 5
Ligand
BDBM17660
Substrate
Ki
22±n/a nM
Comments
PDSP_1580
Citation
 Joly, CGomeza, JBrabet, ICurry, KBockaert, JPin, JP Molecular, functional, and pharmacological characterization of the metabotropic glutamate receptor type 5 splice variants: comparison with mGluR1. J Neurosci 15:3970-81 (1995) Target
Name:
Glutamate metabotropic receptor 5
Synonyms:
metabotropic glutamate 5a | metabotropic glutamate 5b
Type:
Enzyme Catalytic Domain
Mol. Mass.:
120646.45
Organism:
PORCINE
Description:
metabotropic glutamate 5a 0 PORCINE::H0VDS0
Residue:
1094
  
Inhibitor
Name:
BDBM17660
Synonyms:
(2S)-2-amino-3-(3,5-dioxo-1,2,4-oxadiazolidin-2-yl)propanoic acid CHEMBL279956 Quisqualate, L | quisqualic acid
Type:
Small organic molecule
Emp. Form.:
C5H7N3O5
Mol. Mass.:
189.1262
SMILES:
N[C@@H](Cn1oc(=O)[nH]c1=O)C(O)=O
: