Target
Tyrosine-protein phosphatase non-receptor type 1
Ligand
BDBM84501
Substrate
Meas. Tech.
Phosphatase Inhibition Assay
pH
7.2±0
Temperature
310.15±0 K
IC50
2.3e+4± 1.1e+4 nM
Citation
 Fürstner, AReinecke, KPrinz, HWaldmann, H The core structures of roseophilin and the prodigiosin alkaloids define a new class of protein tyrosine phosphatase inhibitors. Chembiochem 5:1575-9 (2004)  
Target
Name:
Tyrosine-protein phosphatase non-receptor type 1
Synonyms:
PTN1_HUMAN PTPN1 Protein tyrosine phosphatase-1B (PTP1B) Protein-tyrosine phosphatase 1B (PTP1B) Tyrosine-protein phosphatase non-receptor type 1 (PTP1B)
Type:
Protein phosphatase
Mol. Mass.:
49963.76
Organism:
Homo sapiens (Human)
Description:
Human recombinant GST-fusion PTP1B (1-435).
Residue:
435
  
Inhibitor
Name:
BDBM84501
Synonyms:
Cyclic analogue, 7
Type:
Small organic molecule
Emp. Form.:
C23H26N2O2
Mol. Mass.:
362.4647
SMILES:
COC1=CC2=N\C1=C/c1ccc(CCCC\C=C\CCCc3ccc2o3)[nH]1
: