Target
P2Y purinoceptor 12
Ligand
BDBM50000911
Substrate
Meas. Tech.
ChEBML_162869
EC50
50300±n/a nM
Citation
 Meanwell, NAPearce, BCRoth, HRSmith, ECWedding, DLWright, JJBuchanan, JOBaryla, UMGamberdella, MGillespie, E Inhibitors of blood platelet cAMP phosphodiesterase. 2. Structure-activity relationships associated with 1,3-dihydro-2H-imidazo[4,5-b]quinolin-2-ones substituted with functionalized side chains. J Med Chem 35:2672-87 (1992)  
Target
Name:
P2Y purinoceptor 12
Synonyms:
ADP-glucose receptor HORK3 P2T(AC) P2Y(AC) P2Y(cyc) P2Y12 platelet ADP receptor Purinergic receptor P2Y12 | SP1999
Type:
Enzyme
Mol. Mass.:
39458.48
Organism:
Homo sapiens (Human)
Description:
Q9H244
Residue:
342
  
Inhibitor
Name:
BDBM50000911
Synonyms:
7-(3-Benzenesulfonyl-propoxy)-1-methyl-1,3-dihydro-imidazo[4,5-b]quinolin-2-one | CHEMBL88698
Type:
Small organic molecule
Emp. Form.:
C20H19N3O4S
Mol. Mass.:
397.448
SMILES:
Cn1c2cc3cc(OCCCS(=O)(=O)c4ccccc4)ccc3nc2[nH]c1=O
: