Target
Cone cGMP-specific 3',5'-cyclic phosphodiesterase subunit alpha'
Ligand
BDBM50241831
Substrate
Meas. Tech.
ChEBML_1670608
IC50
30±n/a nM
Citation
 Fiorito, JVendome, JSaeed, FStaniszewski, AZhang, HYan, SDeng, SXArancio, OLandry, DW Identification of a Novel 1,2,3,4-Tetrahydrobenzo[b][1,6]naphthyridine Analogue as a Potent Phosphodiesterase 5 Inhibitor with Improved Aqueous Solubility for the Treatment of Alzheimer's Disease. J Med Chem 60:8858-8875 (2017)  
Target
Name:
Cone cGMP-specific 3',5'-cyclic phosphodiesterase subunit alpha'
Synonyms:
3',5'-cyclic phosphodiesterase PDE6C_HUMAN Phosphodiesterase 6C | Phosphodiesterase 6C (PDE6C)
Type:
Protein
Mol. Mass.:
99132.02
Organism:
Homo sapiens (Human)
Description:
P51160
Residue:
858
  
Inhibitor
Name:
BDBM50241831
Synonyms:
CHEMBL4062273 US10899756, Compound U
Type:
Small organic molecule
Emp. Form.:
C23H21ClN4O2
Mol. Mass.:
420.891
SMILES:
COc1ccc(CNc2c3CN(CCc3nc3ccc(cc23)C#N)C(C)=O)cc1Cl
: