Target
Chitinase
Ligand
BDBM50254182
Substrate
Meas. Tech.
ChEMBL_1686168 (CHEMBL4036647)
Ki
42000±n/a nM
Citation
 Maccari, GDeodato, DFiorucci, DOrofino, FTruglio, GIPasero, CMartini, RDe Luca, FDocquier, JDBotta, M Design and synthesis of a novel inhibitor of T. Viride chitinase through an in silico target fishing protocol. Bioorg Med Chem Lett 27:3332-3336 (2017)  
Target
Name:
Chitinase
Synonyms:
Chitinase | Endochitinase
Type:
PROTEIN
Mol. Mass.:
46280.30
Organism:
Hypocrea rufa
Description:
ChEMBL_117588
Residue:
424
  
Inhibitor
Name:
BDBM50254182
Synonyms:
CHEMBL3040830
Type:
Small organic molecule
Emp. Form.:
C23H45N7O
Mol. Mass.:
435.6497
SMILES:
N=C(NCCCCCCCCN1CCCCCCCCNC(=N)NC1=O)NCC1CC1
: