Target
Myeloperoxidase
Ligand
BDBM50008371
Substrate
Meas. Tech.
ChEBML_140816
EC50
200000±n/a nM
Citation
 Or, YSClark, RFLane, BMollison, KWCarter, GWLuly, JR Improvements in the minimum binding sequence of C5a: examination of His-67. J Med Chem 35:402-6 (1992)  
Target
Name:
Myeloperoxidase
Synonyms:
84 kDa myeloperoxidase MPO Myeloperoxidase Myeloperoxidase heavy chain PERM_HUMAN
Type:
Enzyme
Mol. Mass.:
83888.32
Organism:
Homo sapiens (Human)
Description:
P05164
Residue:
745
  
Inhibitor
Name:
BDBM50008371
Synonyms:
CHEMBL127385 | H-Thi-Lys-AspMet-GIn-Leu-Gly-Arg-OH
Type:
Small organic molecule
Emp. Form.:
C41H69N13O12S2
Mol. Mass.:
1000.196
SMILES:
CSCC[C@H](NC(=O)[C@H](CC(O)=O)NC(=O)[C@H](CCCCN)NC(=O)[C@H](N)Cc1cccs1)C(=O)N[C@@H](CCC(N)=O)C(=O)N[C@@H](CC(C)C)C(=O)NCC(=O)N[C@@H](CCCNC(N)=N)C(O)=O
: