Target
Renin
Ligand
BDBM50009901
Substrate
Meas. Tech.
ChEMBL_192728 (CHEMBL801755)
IC50
125±n/a nM
Citation
 Doherty, AMKaltenbronn, JSHudspeth, JPRepine, JTRoark, WHSircar, ITinney, FJConnolly, CJHodges, JCTaylor, MD New inhibitors of human renin that contain novel replacements at the P2 site. J Med Chem 34:1258-71 (1991)  
Target
Name:
Renin
Synonyms:
Angiotensinogenase RENI_HUMAN
Type:
Enzyme
Mol. Mass.:
45058.99
Organism:
Homo sapiens (Human)
Description:
Residue:
406
  
Inhibitor
Name:
BDBM50009901
Synonyms:
6-(3-Methyl-thioureido)-2-(3-naphthalen-1-yl-2-naphthalen-1-ylmethyl-propionylamino)-hexanoic acid {4-[2-(2-amino-ethyl)-morpholin-4-yl]-2-hydroxy-1-isobutyl-4-oxo-butyl}-amide | CHEMBL281134
Type:
Small organic molecule
Emp. Form.:
C46H62N6O5S
Mol. Mass.:
811.087
SMILES:
CNC(=S)NCCCCC(NC(=O)C(Cc1cccc2ccccc12)Cc1cccc2ccccc12)C(=O)NC(CC(C)C)[C@@H](O)CC(=O)N1CCOC(CCN)C1
: