Target
Platelet-activating factor receptor
Ligand
BDBM50011100
Substrate
Meas. Tech.
ChEBML_177423
IC50
99±n/a nM
Citation
 Bartrolí, JCarceller, EMerlos, MGarcía-Rafanell, JForn, J Disubstituted tetrahydrofurans and dioxolanes and PAF antagonists. J Med Chem 34:373-86 (1991)  
Target
Name:
Platelet-activating factor receptor
Synonyms:
PAF-R PTAFR_CAVPO Platelet-activating factor receptor
Type:
Protein
Mol. Mass.:
39005.63
Organism:
Cavia porcellus
Description:
Residue:
342
  
Inhibitor
Name:
BDBM50011100
Synonyms:
2-{[Acetyl-(5-hexadecyloxymethyl-tetrahydro-furan-2-ylmethoxycarbonyl)-amino]-methyl}-1-ethyl-pyridinium; iodide | CHEMBL125080
Type:
Small organic molecule
Emp. Form.:
C33H57N2O5
Mol. Mass.:
561.8155
SMILES:
CCCCCCCCCCCCCCCCOCC1CCC(COC(=O)N(Cc2cccc[n+]2CC)C(C)=O)O1
: