Target
Atypical chemokine receptor 3
Ligand
BDBM50264276
Substrate
Meas. Tech.
ChEMBL_1698432 (CHEMBL4049322)
Ki
950±n/a nM
Citation
 Menhaji-Klotz, EHesp, KDLondregan, ATKalgutkar, ASPiotrowski, DWBoehm, MSong, KRyder, TBeaumont, KJones, RMAtkinson, KBrown, JALitchfield, JXiao, JCanterbury, DPBurford, KThuma, BALimberakis, CJiao, WBagley, SWAgarwal, SCrowell, DPazdziorko, SWard, JPrice, DAClerin, V Discovery of a Novel Small-Molecule Modulator of C-X-C Chemokine Receptor Type 7 as a Treatment for Cardiac Fibrosis. J Med Chem 61:3685-3696 (2018)  
Target
Name:
Atypical chemokine receptor 3
Synonyms:
ACKR3 C-X-C chemokine receptor type 7 CMKOR1 CXCR-7 Chemokine orphan receptor 1 G-protein coupled receptor RDC1 homolog RDC-1 | RDC1
Type:
Enzyme
Mol. Mass.:
41498.84
Organism:
Homo sapiens (Human)
Description:
P25106
Residue:
362
  
Inhibitor
Name:
BDBM50264276
Synonyms:
CHEMBL4066544
Type:
Small organic molecule
Emp. Form.:
C25H37N5O
Mol. Mass.:
423.5942
SMILES:
Cc1ccn2ccnc2c1N1CCCN(CC2CCN(CC2)C(=O)C2CCCC2)CC1
: