Target
Poly [ADP-ribose] polymerase 1
Ligand
BDBM50268268
Substrate
Meas. Tech.
ChEMBL_1704612 (CHEMBL4055845)
IC50
5.7±n/a nM
Citation
 Zhao, HJi, MCui, GZhou, JLai, FChen, XXu, B Discovery of novel quinazoline-2,4(1H,3H)-dione derivatives as potent PARP-2 selective inhibitors. Bioorg Med Chem 25:4045-4054 (2017)  
Target
Name:
Poly [ADP-ribose] polymerase 1
Synonyms:
(ARTD1 or PARP1) 2.4.2.30 ADPRT ARTD1 Human diphtheria toxin-like ADP-ribosyltransferase (ARTD1 or PARP1) NT-PARP-1 PARP1 PPOL Poly [ADP-ribose] polymerase 1 (PARP) Poly [ADP-ribose] polymerase 1 (PARP1) Poly [ADP-ribose] polymerase 1, 28-kDa form Poly [ADP-ribose] polymerase 1, processed C-terminus Poly [ADP-ribose] polymerase-1 Poly(ADP-ribose) polymerase-1 (ARTD1/PARP1) Protein poly-ADP-ribosyltransferase PARP1 | Synonyms=ADPRT
Type:
Mol. Mass.:
113114.22
Organism:
Homo sapiens (Human)
Description:
P09874
Residue:
1014
  
Inhibitor
Name:
BDBM50268268
Synonyms:
CHEMBL4061458
Type:
Small organic molecule
Emp. Form.:
C23H24FN5O3
Mol. Mass.:
437.4668
SMILES:
Fc1ncc(Cn2c3ccccc3c(=O)[nH]c2=O)cc1NC(=O)[C@H]1CCN(CC2CC2)C1
: