Target
Glycogen synthase kinase-3 beta
Ligand
BDBM50269471
Substrate
Meas. Tech.
ChEMBL_1706628 (CHEMBL4057861)
IC50
1.8±n/a nM
Citation
 Usui, YUehara, FHiki, SWatanabe, KTanaka, HShouda, AYokoshima, SAritomo, KAdachi, TFukunaga, KSunada, SNabeno, MSaito, KIEguchi, JIYamagami, KAsano, STanaka, SYuki, SYoshii, NFujimura, MHorikawa, T Discovery of novel 2-(3-phenylpiperazin-1-yl)-pyrimidin-4-ones as glycogen synthase kinase-3? inhibitors. Bioorg Med Chem Lett 27:3726-3732 (2017)  
Target
Name:
Glycogen synthase kinase-3 beta
Synonyms:
GSK-3 beta GSK3B Glycogen synthase kinase 3 beta (GSK3B) Glycogen synthase kinase-3 beta (GSK-3B) Glycogen synthase kinase-3 beta (GSK3B) Glycogen synthase kinase-3beta (GSK3B) | Serine/threonine-protein kinase GSK3B
Type:
Enzyme
Mol. Mass.:
46756.38
Organism:
Homo sapiens (Human)
Description:
P49841
Residue:
420
  
Inhibitor
Name:
BDBM50269471
Synonyms:
CHEMBL4085821
Type:
Small organic molecule
Emp. Form.:
C21H24ClN5O2
Mol. Mass.:
413.901
SMILES:
Cl.COc1ccccc1C1CN(CCN1)c1nc(cc(=O)n1C)-c1ccncc1
: